BDBM82928 9-methoxy-3,3-dimethyl-2,4,4a,7,7a,13-hexahydro-1H-4,12-methanobenzofuro[3,2-e]isoquinoline-3-ium-7-ol;iodide::MLS001215943::SMR000544670::cid_24747698
SMILES [H]C12Cc3ccc(OC)c4OC5C(O)C=CC1C5(CC[N+]2(C)C)c34
InChI Key InChIKey=MLIBORQWQWVNCO-UHFFFAOYSA-N
Data  1 IC50
  Tab Delimited (TSV)   2D SDfile   Computed 3D by Vconf -m prep SDfile
Find this compound or compounds like it in BindingDB:
Activity Spreadsheet -- Enzyme Inhibition Constant Data from BindingDB
Found 1 hit for monomerid = 82928
TargetCarboxy-terminal domain RNA polymerase II polypeptide A small phosphatase 1(Homo sapiens (Human))
Burnham Center For Chemical Genomics
Curated by PubChem BioAssay
LigandPNGBDBM82928(9-methoxy-3,3-dimethyl-2,4,4a,7,7a,13-hexahydro-1H...)
Affinity DataIC50:  7.00E+3nM. Assay description: Data Source: Sanford-Burnham Center for Chemical Genomics (SBCCG) Source Affiliation: Sanford-Burnham Medical Research Institute (SBMRI, San Diego, C...
In DepthDetails PCBioAssay